�Ǘ��ԍ�,�@��䒠��,���L���Y�䒠�ԍ�,�@��䒠�ԍ�,����,���ݒn����,�n��,��������,����Ȗږ���,�{�ݖ���,��v�R�[�h,���R�[�h,���R�[�h,�ڃR�[�h,�זڃR�[�h,�ׁX�ڃR�[�h,���ƕ��ޖ���,���Y����,�ړI���Y�敪����,�p�r,���[�X�敪,���p�]���֊���Ȗږ���,���p�]���敪,�擾�N����,���p�J�n�N����,�ϗp�N�����ޖ���,�ϗp�N��,�o�ߊ���,�󑡍w���敪,�ŏI�뉿�敪,�����ٓ����t,�ٓ����R,���ʁi�����ʐρj,�P��,�n�ڂ܂��͎��,�擾������,�K���i�����j�n��K��,�K���i�����j�n���K��,���L����,�p�r�w�萧���N��,���p�\�敪,�ғ��N��,�e�푮�����
0000035154-001-001,���i�䒠,,00-0293130,�~���p�{�[�g�^�R�D�R�P���i�S�R�s�U�j,�S�R�s,'�S�R�����n���,�h�Њ�@�Ǘ���,�a�r�Œ莑�Y�^�C���t���^�L�`�^���̑��L�`�Œ莑�Y�擾�z,���̑��h�Аݔ�,1,9,1,1,6,51,���h�{�݈ێ��Ǘ���,�s�����Y,�h�Ў{�݁i���h�ȊO�j,�D��,���L���Y,�a�r�Œ莑�Y�^�C���t���^�L�`�^���̑��L�`�Œ莑�Y�������p�݌v�z,�������p,37454,37454,�T�N,5,14,�w���E���̑�,1�~,42461,���̑��擾,1,��,,�s��,,,100,,�s��,14,�����ȗ߁E�ʕ\�P�E�D���E���̑��̂��́E���̑��̂��́E���̑��̂���
0000035155-001-001,���i�䒠,,00-0293134,�~���p�{�[�g�^�R�D�R�P���i�S�R�s�Y�j,�S�R�s,'�S�R�����n���,�h�Њ�@�Ǘ���,�a�r�Œ莑�Y�^�C���t���^�L�`�^���̑��L�`�Œ莑�Y�擾�z,���̑��h�Аݔ�,1,9,1,1,6,51,���h�{�݈ێ��Ǘ���,�s�����Y,�h�Ў{�݁i���h�ȊO�j,�D��,���L���Y,�a�r�Œ莑�Y�^�C���t���^�L�`�^���̑��L�`�Œ莑�Y�������p�݌v�z,�������p,37454,37454,�T�N,5,14,�w���E���̑�,1�~,42461,���̑��擾,1,��,,�s��,,,100,,�s��,14,�����ȗ߁E�ʕ\�P�E�D���E���̑��̂��́E���̑��̂��́E���̑��̂���
0000035156-001-001,���i�䒠,,00-0293131,�~���p�{�[�g�^�R�D�R�P���i�S�R�s�V�j,�S�R�s,'�S�R���n���,�h�Њ�@�Ǘ���,�a�r�Œ莑�Y�^�C���t���^�L�`�^���̑��L�`�Œ莑�Y�擾�z,���̑��h�Аݔ�,1,9,1,1,6,51,���h�{�݈ێ��Ǘ���,�s�����Y,�h�Ў{�݁i���h�ȊO�j,�D��,���L���Y,�a�r�Œ莑�Y�^�C���t���^�L�`�^���̑��L�`�Œ莑�Y�������p�݌v�z,�������p,37454,37454,�T�N,5,14,�w���E���̑�,1�~,42461,���̑��擾,1,��,,�s��,,,100,,�s��,14,�����ȗ߁E�ʕ\�P�E�D���E���̑��̂��́E���̑��̂��́E���̑��̂���
0000035157-001-001,���i�䒠,,00-0293132,�~���p�{�[�g�^�R�D�R�P���i�S�R�s�W�j,�S�R�s,'�S�R���n���,�h�Њ�@�Ǘ���,�a�r�Œ莑�Y�^�C���t���^�L�`�^���̑��L�`�Œ莑�Y�擾�z,���̑��h�Аݔ�,1,9,1,1,6,51,���h�{�݈ێ��Ǘ���,�s�����Y,�h�Ў{�݁i���h�ȊO�j,�D��,���L���Y,�a�r�Œ莑�Y�^�C���t���^�L�`�^���̑��L�`�Œ莑�Y�������p�݌v�z,�������p,37454,37454,�T�N,5,14,�w���E���̑�,1�~,42461,���̑��擾,1,��,,�s��,,,100,,�s��,14,�����ȗ߁E�ʕ\�P�E�D���E���̑��̂��́E���̑��̂��́E���̑��̂���
0000035158-001-001,���i�䒠,,00-0293133,�~���p�{�[�g�^�R�D�R�P���i�S�R�s�X�j,�S�R�s,'�S�R���n���,�h�Њ�@�Ǘ���,�a�r�Œ莑�Y�^�C���t���^�L�`�^���̑��L�`�Œ莑�Y�擾�z,���̑��h�Аݔ�,1,9,1,1,6,51,���h�{�݈ێ��Ǘ���,�s�����Y,�h�Ў{�݁i���h�ȊO�j,�D��,���L���Y,�a�r�Œ莑�Y�^�C���t���^�L�`�^���̑��L�`�Œ莑�Y�������p�݌v�z,�������p,37454,37454,�T�N,5,14,�w���E���̑�,1�~,42461,���̑��擾,1,��,,�s��,,,100,,�s��,14,�����ȗ߁E�ʕ\�P�E�D���E���̑��̂��́E���̑��̂��́E���̑��̂���
0000035159-001-001,���i�䒠,,00-0293136,�~���p�{�[�g�^�R�D�W�U���i�͐�j,�S�R�s,'�x�v�R�n���,�h�Њ�@�Ǘ���,�a�r�Œ莑�Y�^�C���t���^�L�`�^���̑��L�`�Œ莑�Y�擾�z,���̑��h�Аݔ�,1,9,1,1,6,51,���h�{�݈ێ��Ǘ���,�s�����Y,�h�Ў{�݁i���h�ȊO�j,�D��,���L���Y,�a�r�Œ莑�Y�^�C���t���^�L�`�^���̑��L�`�Œ莑�Y�������p�݌v�z,�������p,37656,37656,�T�N,5,14,�w���E���̑�,1�~,42461,���̑��擾,1,��,,�s��,,,100,,�s��,14,�����ȗ߁E�ʕ\�P�E�D���E���̑��̂��́E���̑��̂��́E���̑��̂���
0000035160-001-001,���i�䒠,,00-0293129,�~���p�{�[�g�^�R�D�W�S���i�S�R�s�j,�S�R�s,'�Γ�n���,�h�Њ�@�Ǘ���,�a�r�Œ莑�Y�^�C���t���^�L�`�^���̑��L�`�Œ莑�Y�擾�z,���̑��h�Аݔ�,1,9,1,1,6,51,���h�{�݈ێ��Ǘ���,�s�����Y,�h�Ў{�݁i���h�ȊO�j,�D��,���L���Y,�a�r�Œ莑�Y�^�C���t���^�L�`�^���̑��L�`�Œ莑�Y�������p�݌v�z,�������p,37817,37817,�T�N,5,13,�w���E���̑�,1�~,42461,���̑��擾,1,��,,�s��,,,100,,�s��,13,�����ȗ߁E�ʕ\�P�E�D���E���̑��̂��́E���̑��̂��́E���̑��̂���
0000035161-001-001,���i�䒠,,00-0293135,�~���p�{�[�g�^�R�D�V�S���i�S�R�s�Z�j,�S�R�s,'�Γ�n���,�h�Њ�@�Ǘ���,�a�r�Œ莑�Y�^�C���t���^�L�`�^���̑��L�`�Œ莑�Y�擾�z,���̑��h�Аݔ�,1,9,1,1,6,51,���h�{�݈ێ��Ǘ���,�s�����Y,�h�Ў{�݁i���h�ȊO�j,�D��,���L���Y,�a�r�Œ莑�Y�^�C���t���^�L�`�^���̑��L�`�Œ莑�Y�������p�݌v�z,�������p,37454,37454,�T�N,5,14,�w���E���̑�,1�~,42461,���̑��擾,1,��,,�s��,,,100,,�s��,14,�����ȗ߁E�ʕ\�P�E�D���E���̑��̂��́E���̑��̂��́E���̑��̂���
0000035788-001-002,���i�䒠,,00-0292499,����~���p�S���{�[�g�^�{�[�g�F�A�L���X�e�q�a�|�R�W�O�@�D�O�@�F�g�[�n�c�l�e�r�Q�O�c�|�k,�S�R�s,'�ڕl�ΐ������S�΍��{��,�h�Њ�@�Ǘ���,�a�r�Œ莑�Y�^�C���t���^�L�`�^���̑��L�`�Œ莑�Y�擾�z,���̑��h�Аݔ�,1,9,1,1,6,51,���h�{�݈ێ��Ǘ���,�s�����Y,�h�Ў{�݁i���h�ȊO�j,�D��,���L���Y,�a�r�Œ莑�Y�^�C���t���^�L�`�^���̑��L�`�Œ莑�Y�������p�݌v�z,�������p,42338,42338,�T�N,5,1,�w���E���̑�,1�~,42825,���Ǌ�,1,��,,��ʍ���,,,100,0,�s��,,�����ȗ߁E�ʕ\�P�E�D���E���̑��̂��́E���̑��̂��́E���̑��̂���
0000035864-001-001,���i�䒠,,00-0288249,�D�O�@�t���{�[�g�^,�S�R�s,'�S�R�s���h�c���ϒn���,�h�Њ�@�Ǘ���,�a�r�Œ莑�Y�^�C���t���^�L�`�^���̑��L�`�Œ莑�Y�擾�z,���̑��h�Аݔ�,1,9,1,1,6,51,���h�{�݈ێ��Ǘ���,�s�����Y,�h�Ў{�݁i���h�ȊO�j,�D��,���L���Y,�a�r�Œ莑�Y�^�C���t���^�L�`�^���̑��L�`�Œ莑�Y�������p�݌v�z,�������p,42114,42114,�T�N,5,1,��,1�~,42114,��t,1,��,,���̑�,,,100,0,�s��,2,�����ȗ߁E�ʕ\�P�E�D���E���̑��̂��́E���̑��̂��́E���̑��̂���
