�Ǘ��ԍ�,�@��䒠��,���L���Y�䒠�ԍ�,�@��䒠�ԍ�,����,���ݒn����,�n��,��������,����Ȗږ���,�{�ݖ���,��v�R�[�h,���R�[�h,���R�[�h,�ڃR�[�h,�זڃR�[�h,�ׁX�ڃR�[�h,���ƕ��ޖ���,���Y����,�ړI���Y�敪����,�p�r,���[�X�敪,���p�]���֊���Ȗږ���,���p�]���敪,�擾�N����,���p�J�n�N����,�ϗp�N�����ޖ���,�ϗp�N��,�o�ߊ���,�󑡍w���敪,�ŏI�뉿�敪,�����ٓ����t,�ٓ����R,���ʁi�����ʐρj,�P��,�n�ڂ܂��͎��,�擾������,�K���i�����j�n��K��,�K���i�����j�n���K��,���L����,�p�r�w�萧���N��,���p�\�敪,�ғ��N��,�e�푮�����
0000000001-001-001,���i�䒠,,00-0282026,����@�^�N�{�^�j�r�q�|�P�O�Q�Q�r,�S�R�s,'�����@����,�����@����,�a�r�Œ莑�Y�^���i�^���i�擾�z,�{���E�{����,1,2,1,1,11,51,���Ɉێ��Ǘ���,�s�����Y,�{���i���ɊǗ����j,����,���L���Y,�a�r�Œ莑�Y�^���i�^���i�������p�݌v�z,�������p,41712,41712,�P�O�N,10,3,�w���E���̑�,1�~,42095,���̑��擾,1,��,,��ʍ���,,,100,0,�s��,3,�����ȗߕʕ\��P�E���y�є��i�E�P�P�O�f�̂��̈ȊO�̂��́E���̑��̂��́E��Ƃ��ċ������̂���
0000000002-001-001,���i�䒠,,00-0282025,����@�^�N�{�^�j�r�q�|�P�O�Q�Q�r,�S�R�s,'�����@����,�����@����,�a�r�Œ莑�Y�^���i�^���i�擾�z,�{���E�{����,1,2,1,1,11,51,���Ɉێ��Ǘ���,�s�����Y,�{���i���ɊǗ����j,����,���L���Y,�a�r�Œ莑�Y�^���i�^���i�������p�݌v�z,�������p,41712,41712,�P�O�N,10,3,�w���E���̑�,1�~,42095,���̑��擾,1,��,,��ʍ���,,,100,0,�s��,3,�����ȗߕʕ\��P�E���y�є��i�E�P�P�O�f�̂��̈ȊO�̂��́E���̑��̂��́E��Ƃ��ċ������̂���
0000000003-001-001,���i�䒠,,00-0007377,�G��u�s��Ȃ锒���̎��v�^�T�Q�O�����P�Q�ڏc�V��,�S�R�s,'�����@����,�����@����,�a�r�Œ莑�Y�^���i�^���i�擾�z,�{���E�{����,1,2,1,1,11,51,���Ɉێ��Ǘ���,�s�����Y,�{���i���ɊǗ����j,�ӏܗp,���L���Y,�a�r�Œ莑�Y�^���i�^���i�������p�݌v�z,�������p,28590,28590,�W�N,8,38,��,1�~,42095,���̑��擾,1,�_,,���̑�,,,100,,�s��,38,�����ȗߕʕ\��P�E���y�є��i�E�P�Ƌ�A�d�C�@��A�K�X�@��y�щƒ�p�i�E���������i�E���̑��̂���
0000000004-001-001,���i�䒠,,00-0000211,�e���كI�t�Z�b�g����@�^�X�v�����g�r�Q�U�i�P�F�j,�S�R�s,'�����@���ۈ����,�����@����,�a�r�Œ莑�Y�^���i�^���i�擾�z,�{���E�{����,1,2,1,1,7,51,�򏑈����,�s�����Y,�{���i���ɊǗ����j,������p,���L���Y,�a�r�Œ莑�Y�^���i�^���i�������p�݌v�z,�������p,37833,37833,������ށi�@�B���u�j,10,13,�w���E���̑�,1�~,42095,���̑��擾,1,��,,��ʍ���,,,100,0,�s��,13,
0000000005-001-001,���i�䒠,,00-0007280,��^�����ԁi�����Q�Q���V�Q�X�R�j�^�Q�X�l���}�C�N���o�X,�S�R�s,'�����@����,�����@����,�a�r�Œ莑�Y�^���i�^���i�擾�z,�{���E�{����,1,2,1,1,12,1,���p�ԏW���Ǘ����Ɣ,�s�����Y,�{���i���ɊǗ����j,���p��,���L���Y,�a�r�Œ莑�Y�^���i�^���i�������p�݌v�z,�������p,33106,33106,�U�N,6,26,�w���E���̑�,1�~,42095,���̑��擾,1,��,,��ʍ���,,,100,0,�s��,26,�����ȗߕʕ\��P�E�ԗ��y�щ^����E�O�f�̂��̈ȊO�̂��́E�����ԁE���̑��̂��́E���̑��̂���
0000000006-001-001,���i�䒠,,00-0007461,�n�ʉ�u�t�g�Ó��v�^�P�Q�O��,�S�R�s,'�����@����,�����@����,�a�r�Œ莑�Y�^���i�^���i�擾�z,�{���E�{����,1,2,1,1,11,51,���Ɉێ��Ǘ���,�s�����Y,�{���i���ɊǗ����j,�ӏܗp,���L���Y,�a�r�Œ莑�Y�^���i�^���i�������p�݌v�z,�������p,35481,35481,�W�N,8,20,��,1�~,42095,���̑��擾,1,�_,,���̑�,,,100,,�s��,20,�����ȗߕʕ\��P�E���y�є��i�E�P�Ƌ�A�d�C�@��A�K�X�@��y�щƒ�p�i�E���������i�E���̑��̂���
0000000007-001-001,���i�䒠,,00-0007465,�ʖn��u�����̌܌��v�^�P�T�O��,�S�R�s,'�����@����,�����@����,�a�r�Œ莑�Y�^���i�^���i�擾�z,�{���E�{����,1,2,1,1,11,51,���Ɉێ��Ǘ���,�s�����Y,�{���i���ɊǗ����j,�ӏܗp,���L���Y,�a�r�Œ莑�Y�^���i�^���i�������p�݌v�z,�������p,38190,38190,�W�N,8,12,��,1�~,42095,���̑��擾,1,�_,,���̑�,,,100,,�s��,12,�����ȗߕʕ\��P�E���y�є��i�E�P�Ƌ�A�d�C�@��A�K�X�@��y�щƒ�p�i�E���������i�E���̑��̂���
0000000008-001-001,���i�䒠,,00-0007376,�G��u�݂̂�̏H�v�^�T�O�O��,�S�R�s,'�����@����,�����@����,�a�r�Œ莑�Y�^���i�^���i�擾�z,�{���E�{����,1,2,1,1,11,51,���Ɉێ��Ǘ���,�s�����Y,�{���i���ɊǗ����j,�ӏܗp,���L���Y,�a�r�Œ莑�Y�^���i�^���i�������p�݌v�z,�������p,27716,27716,�W�N,8,41,��,1�~,42095,���̑��擾,1,�_,,���̑�,,,100,,�s��,41,�����ȗߕʕ\��P�E���y�є��i�E�P�Ƌ�A�d�C�@��A�K�X�@��y�щƒ�p�i�E���������i�E���̑��̂���
0000000009-001-001,���i�䒠,,00-0007423,���{��u�R�́v�^�P�T�O��,�S�R�s,'�����@����,�����@����,�a�r�Œ莑�Y�^���i�^���i�擾�z,�{���E�{����,1,2,1,1,11,51,���Ɉێ��Ǘ���,�s�����Y,�{���i���ɊǗ����j,�ӏܗp,���L���Y,�a�r�Œ莑�Y�^���i�^���i�������p�݌v�z,�������p,34348,34348,�W�N,8,23,��,1�~,42095,���̑��擾,1,�_,,���̑�,,,100,,�s��,23,�����ȗߕʕ\��P�E���y�є��i�E�P�Ƌ�A�d�C�@��A�K�X�@��y�щƒ�p�i�E���������i�E���̑��̂���
0000000010-001-001,���i�䒠,,00-0000212,�������ʈ���@�^�`�R���C�h���@�c�t�R�S�U,�S�R�s,'�����@���ۈ����,�����@����,�a�r�Œ莑�Y�^���i�^���i�擾�z,�{���E�{����,1,2,1,1,7,51,�򏑈����,�s�����Y,�{���i���ɊǗ����j,������p,���L���Y,�a�r�Œ莑�Y�^���i�^���i�������p�݌v�z,�������p,39034,39034,������ށi�@�B���u�j,10,10,�w���E���̑�,1�~,42461,���̑��擾,1,��,,��ʍ���,,,100,0,�s��,10,
0000000011-001-001,���i�䒠,,00-0217851,�����@�i���󂯃X�C���O��t���j�^�u�`�b�|�Q�O�O�O�z���]���i���z���@�j,�S�R�s,'�����@���ۈ����,�����@����,�a�r�Œ莑�Y�^���i�^���i�擾�z,�{���E�{����,1,2,1,1,7,51,�򏑈����,�s�����Y,�{���i���ɊǗ����j,������p,���L���Y,�a�r�Œ莑�Y�^���i�^���i�������p�݌v�z,�������p,40785,40785,������ށi�@�B���u�j,10,5,�w���E���̑�,1�~,42095,���̑��擾,1,��,,��ʍ���,,,100,0,�s��,5,
0000000012-001-001,���i�䒠,,00-0000210,�V���o�[�}�X�^�[��p�������ŋ@�^�O�H�������b�o�|�U�P�O�r,�S�R�s,'�����@���ۈ����,�����@����,�a�r�Œ莑�Y�^���i�^���i�擾�z,�{���E�{����,1,2,1,1,7,51,�򏑈����,�s�����Y,�{���i���ɊǗ����j,������p,���L���Y,�a�r�Œ莑�Y�^���i�^���i�������p�݌v�z,�������p,37286,37286,������ށi�@�B���u�j,10,15,�w���E���̑�,1�~,42095,���̑��擾,1,��,,��ʍ���,,,100,0,�s��,15,
0000000013-001-001,���i�䒠,,00-0055516,�n�̉�u�킽�����炭�����v�^���{��P�Q�O���g�P�U�O�p�~�v�Q�Q�O�p,�S�R�s,'�����@����,�����@����,�a�r�Œ莑�Y�^���i�^���i�擾�z,�{���E�{����,1,2,1,1,11,51,���Ɉێ��Ǘ���,�s�����Y,�{���i���ɊǗ����j,�ӏܗp,���L���Y,�a�r�Œ莑�Y�^���i�^���i�������p�݌v�z,�������p,31460,31460,�W�N,8,31,��,1�~,42095,���̑��擾,1,�_,,���̑�,,,100,,�s��,31,�����ȗߕʕ\��P�E���y�є��i�E�P�Ƌ�A�d�C�@��A�K�X�@��y�щƒ�p�i�E���������i�E���̑��̂���
0000000014-001-001,���i�䒠,,00-0203347,���ʎ����ԁ^���Y�t�[�K�Q�T�O�f�s�^�C�v�o,�S�R�s,'�����@����,�����@����,�a�r�Œ莑�Y�^���i�^���i�擾�z,�{���E�{����,1,2,1,1,12,1,���p�ԏW���Ǘ����Ɣ,�s�����Y,�{���i���ɊǗ����j,���p��,���L���Y,�a�r�Œ莑�Y�^���i�^���i�������p�݌v�z,�������p,39535,39535,�U�N,6,9,�w���E���̑�,1�~,42095,���̑��擾,1,��,,��ʍ���,,,100,0,�s��,9,�����ȗߕʕ\��P�E�ԗ��y�щ^����E�O�f�̂��̈ȊO�̂��́E�����ԁE���̑��̂��́E���̑��̂���
0000000015-001-001,���i�䒠,,00-0245813,�d�C�y�����ԁ^�O�H���|�l���d�u�O���[�h�f�y�`�`�|�g�`�R�v�k�c�c,�S�R�s,'�����@����,�����@����,�a�r�Œ莑�Y�^���i�^���i�擾�z,�{���E�{����,1,2,1,1,12,1,���p�ԏW���Ǘ����Ɣ,�s�����Y,�{���i���ɊǗ����j,���p��,���L���Y,�a�r�Œ莑�Y�^���i�^���i�������p�݌v�z,�������p,40872,40872,�S�N,4,5,�w���E���̑�,1�~,42095,���̑��擾,1,��,,��ʍ���,,,100,0,�s��,5,�����ȗ߁E�ʕ\�P�E�ԗ��y�щ^����E�O�f�̂��̈ȊO�̂��́E�����ԁE���^��
0000000016-001-001,���i�䒠,,00-0004988,�~�[�e�B���O�e�[�u���ꎮ�^�I�J�����Q�P�X�U�V���[�Y�i�g��,�S�R�s,'���c��,�����@����,�a�r�Œ莑�Y�^���i�^���i�擾�z,�{���E�{����,1,2,1,1,2,51,�����@���ۊǗ�������,�s�����Y,�{���i���ɊǗ����j,���c�p,���L���Y,�a�r�Œ莑�Y�^���i�^���i�������p�݌v�z,�������p,34878,34878,���ށi�������ȊO�j,8,21,�w���E���̑�,1�~,42095,���̑��擾,1,��,,��ʍ���,,,100,0,�s��,21,�����ȗ߁E�ʕ\�P�E���y�є��i�E�P�Ƌ�A�d�C�@��A�K�X�@��y�щƒ�p�i�E���̑��̂��́E���̑��̂���
0000000017-001-001,���i�䒠,,00-0000197,�f�ً@�^�i��i�m�b�|�V�R�g�g�j�m�b�c�r,�S�R�s,'�����@���ۈ����,�����@����,�a�r�Œ莑�Y�^���i�^���i�擾�z,�{���E�{����,1,2,1,1,7,51,�򏑈����,�s�����Y,�{���i���ɊǗ����j,������p,���L���Y,�a�r�Œ莑�Y�^���i�^���i�������p�݌v�z,�������p,30345,30345,������ށi�@�B���u�j,10,34,�w���E���̑�,1�~,42095,���̑��擾,1,��,,��ʍ���,,,100,0,�s��,34,
0000000018-001-001,���i�䒠,,00-0007290,����Q��p�ԁi�����R�O�O�ĂT�S�R�Q�j�^�g���^�G�X�e�B�}�n�C�u���b�h,�S�R�s,'�����@����,�����@����,�a�r�Œ莑�Y�^���i�^���i�擾�z,�{���E�{����,1,2,1,1,12,1,���p�ԏW���Ǘ����Ɣ,�s�����Y,�{���i���ɊǗ����j,���p��,���L���Y,�a�r�Œ莑�Y�^���i�^���i�������p�݌v�z,�������p,37470,37470,�U�N,6,14,�w���E���̑�,1�~,42095,���̑��擾,1,��,,��ʍ���,,,100,0,�s��,14,�����ȗߕʕ\��P�E�ԗ��y�щ^����E�O�f�̂��̈ȊO�̂��́E�����ԁE���̑��̂��́E���̑��̂���
0000000019-001-001,���i�䒠,,00-0205582,���{�@�i���������ԋ@�A�r�����u�t���j�^�a�p�|�Q�V�O�z���]���i���z���@�j,�S�R�s,'�����@���ۈ����,�����@����,�a�r�Œ莑�Y�^���i�^���i�擾�z,�{���E�{����,1,2,1,1,7,51,�򏑈����,�s�����Y,�{���i���ɊǗ����j,������p,���L���Y,�a�r�Œ莑�Y�^���i�^���i�������p�݌v�z,�������p,39685,39685,������ށi�@�B���u�j,10,8,�w���E���̑�,1�~,42095,���̑��擾,1,��,,��ʍ���,,,100,0,�s��,8,
0000000021-001-001,���i�䒠,,00-0000202,���܋@�^�������}�b�n�G�C�g�i�e���ٌ^�j���^�v���X,�S�R�s,'�����@���ۈ����,�����@����,�a�r�Œ莑�Y�^���i�^���i�擾�z,�{���E�{����,1,2,1,1,7,51,�򏑈����,�s�����Y,�{���i���ɊǗ����j,������p,���L���Y,�a�r�Œ莑�Y�^���i�^���i�������p�݌v�z,�������p,31167,31167,������ށi�@�B���u�j,10,31,�w���E���̑�,1�~,42095,���̑��擾,1,��,,��ʍ���,,,100,0,�s��,31,
0000000022-001-001,���i�䒠,,00-0029910,���^��p�ԁi�����T�O�O�ȂQ�R�Q�T�j�^�g���^�N���E���`�s,�S�R�s,'�����@����,�����@����,�a�r�Œ莑�Y�^���i�^���i�擾�z,�{���E�{����,1,2,1,1,12,1,���p�ԏW���Ǘ����Ɣ,�s�����Y,�{���i���ɊǗ����j,���p��,���L���Y,�a�r�Œ莑�Y�^���i�^���i�������p�݌v�z,�������p,37032,37032,�U�N,6,15,�w���E���̑�,1�~,42095,���̑��擾,1,��,,��ʍ���,,,100,0,�s��,15,�����ȗߕʕ\��P�E�ԗ��y�щ^����E�O�f�̂��̈ȊO�̂��́E�����ԁE���̑��̂��́E���̑��̂���
0000000023-001-001,���i�䒠,,00-0007289,���ʏ�p�����ԕ����T�Q��V�W�Q�U�^�g���^�N���E���Q�O�O�O�����r�T���[���d�w,�S�R�s,'�����@����,�����@����,�a�r�Œ莑�Y�^���i�^���i�擾�z,�{���E�{����,1,2,1,1,12,1,���p�ԏW���Ǘ����Ɣ,�s�����Y,�{���i���ɊǗ����j,���p��,���L���Y,�a�r�Œ莑�Y�^���i�^���i�������p�݌v�z,�������p,35243,35243,�U�N,6,20,�w���E���̑�,1�~,42095,���̑��擾,1,��,,��ʍ���,,,100,0,�s��,20,�����ȗߕʕ\��P�E�ԗ��y�щ^����E�O�f�̂��̈ȊO�̂��́E�����ԁE���̑��̂��́E���̑��̂���
0000000024-001-001,���i�䒠,,00-0007286,���^��p�ԁi����Q�ԁj�����T�O�O���T�T�R�T�^�g���^�v���E�X�P�D�T�H�`�s,�S�R�s,'�����@����,�����@����,�a�r�Œ莑�Y�^���i�^���i�擾�z,�{���E�{����,1,2,1,1,12,1,���p�ԏW���Ǘ����Ɣ,�s�����Y,�{���i���ɊǗ����j,���p��,���L���Y,�a�r�Œ莑�Y�^���i�^���i�������p�݌v�z,�������p,36647,36647,�U�N,6,16,�w���E���̑�,1�~,42095,���̑��擾,1,��,,��ʍ���,,,100,0,�s��,16,�����ȗߕʕ\��P�E�ԗ��y�щ^����E�O�f�̂��̈ȊO�̂��́E�����ԁE���̑��̂��́E���̑��̂���
0000000025-001-001,���i�䒠,,00-0002933,���^��p�ԁi�����R�O�O�ʂW�S�X�T�j�^�g���^�v���E�X�r,�S�R�s,'�����@����,�����@����,�a�r�Œ莑�Y�^���i�^���i�擾�z,�{���E�{����,1,2,1,1,12,1,���p�ԏW���Ǘ����Ɣ,�s�����Y,�{���i���ɊǗ����j,���p��,���L���Y,�a�r�Œ莑�Y�^���i�^���i�������p�݌v�z,�������p,38153,38153,�U�N,6,12,�w���E���̑�,1�~,42095,���̑��擾,1,��,,��ʍ���,,,100,0,�s��,12,�����ȗߕʕ\��P�E�ԗ��y�щ^����E�O�f�̂��̈ȊO�̂��́E�����ԁE���̑��̂��́E���̑��̂���
0000000026-001-001,���i�䒠,,00-0007292,���^��p�ԕ����T�O�O�܂Q�S�V�X�^�i����Q�ԁj�g���^�v���E�X�r,�S�R�s,'�����@����,�����@����,�a�r�Œ莑�Y�^���i�^���i�擾�z,�{���E�{����,1,2,1,1,12,1,���p�ԏW���Ǘ����Ɣ,�s�����Y,�{���i���ɊǗ����j,���p��,���L���Y,�a�r�Œ莑�Y�^���i�^���i�������p�݌v�z,�������p,37771,37771,�U�N,6,13,�w���E���̑�,1�~,42095,���̑��擾,1,��,,��ʍ���,,,100,0,�s��,13,�����ȗߕʕ\��P�E�ԗ��y�щ^����E�O�f�̂��̈ȊO�̂��́E�����ԁE���̑��̂��́E���̑��̂���
0000000027-001-001,���i�䒠,,00-0007323,��p�����ԕ����T�R�͂Q�P�R�V�^����Q�ԃg���^�v���E�X,�S�R�s,'�����@����,�����@����,�a�r�Œ莑�Y�^���i�^���i�擾�z,�{���E�{����,1,2,1,1,12,1,���p�ԏW���Ǘ����Ɣ,�s�����Y,�{���i���ɊǗ����j,���p��,���L���Y,�a�r�Œ莑�Y�^���i�^���i�������p�݌v�z,�������p,36277,36277,�U�N,6,17,�w���E���̑�,1�~,42095,���̑��擾,1,��,,��ʍ���,,,100,0,�s��,17,�����ȗߕʕ\��P�E�ԗ��y�щ^����E�O�f�̂��̈ȊO�̂��́E�����ԁE���̑��̂��́E���̑��̂���
0000000028-001-001,���i�䒠,,00-0007285,���^��p�ԁi����Q�ԁj�����T�R�͂Q�P�R�W�^�g���^�v���E�X,�S�R�s,'�����@����,�����@����,�a�r�Œ莑�Y�^���i�^���i�擾�z,�{���E�{����,1,2,1,1,12,1,���p�ԏW���Ǘ����Ɣ,�s�����Y,�{���i���ɊǗ����j,���p��,���L���Y,�a�r�Œ莑�Y�^���i�^���i�������p�݌v�z,�������p,36277,36277,�U�N,6,17,�w���E���̑�,1�~,42095,���̑��擾,1,��,,��ʍ���,,,100,0,�s��,17,�����ȗߕʕ\��P�E�ԗ��y�щ^����E�O�f�̂��̈ȊO�̂��́E�����ԁE���̑��̂��́E���̑��̂���
0000000029-001-001,���i�䒠,,00-0007288,���^��p�ԁi�����T�O�O�ȂQ�V�V�U�j�^�j�b�T���Z���i�Q�O�O�O����,�S�R�s,'�����@����,�����@����,�a�r�Œ莑�Y�^���i�^���i�擾�z,�{���E�{����,1,2,1,1,12,1,���p�ԏW���Ǘ����Ɣ,�s�����Y,�{���i���ɊǗ����j,���p��,���L���Y,�a�r�Œ莑�Y�^���i�^���i�������p�݌v�z,�������p,37036,37036,�U�N,6,15,�w���E���̑�,1�~,42095,���̑��擾,1,��,,��ʍ���,,,100,0,�s��,15,�����ȗߕʕ\��P�E�ԗ��y�щ^����E�O�f�̂��̈ȊO�̂��́E�����ԁE���̑��̂��́E���̑��̂���
0000000030-001-001,���i�䒠,,00-0007346,���^��p�ԁ^�V�r�b�N�n�C�u���b�h�l�w�a,�S�R�s,'�����@����,�����@����,�a�r�Œ莑�Y�^���i�^���i�擾�z,�{���E�{����,1,2,1,1,12,1,���p�ԏW���Ǘ����Ɣ,�s�����Y,�{���i���ɊǗ����j,���p��,���L���Y,�a�r�Œ莑�Y�^���i�^���i�������p�݌v�z,�������p,38933,38933,�U�N,6,10,�w���E���̑�,1�~,42095,���̑��擾,1,��,,��ʍ���,,,100,0,�s��,10,�����ȗߕʕ\��P�E�ԗ��y�щ^����E�O�f�̂��̈ȊO�̂��́E�����ԁE���̑��̂��́E���̑��̂���
0000000031-001-001,���i�䒠,,00-0007284,���^�}�C�N���o�X�i�����Q�Q���X�O�U�R�j�^�n�C�G�[�X�R�~���[�^�[�f�k,�S�R�s,'�����@����,�����@����,�a�r�Œ莑�Y�^���i�^���i�擾�z,�{���E�{����,1,2,1,1,12,1,���p�ԏW���Ǘ����Ɣ,�s�����Y,�{���i���ɊǗ����j,���p��,���L���Y,�a�r�Œ莑�Y�^���i�^���i�������p�݌v�z,�������p,35621,35621,�U�N,6,19,�w���E���̑�,1�~,42095,���̑��擾,1,��,,��ʍ���,,,100,0,�s��,19,�����ȗߕʕ\��P�E�ԗ��y�щ^����E�O�f�̂��̈ȊO�̂��́E�����ԁE���̑��̂��́E���̑��̂���
0000000032-001-001,���i�䒠,,00-0001265,�P�O�l��胏�S���ԕ����T�Q��Q�S�U�Q�^���Y�z�[�~�[�R�[�`�c�w�S�v�c,�S�R�s,'�����@����,�����@����,�a�r�Œ莑�Y�^���i�^���i�擾�z,�{���E�{����,1,2,1,1,12,1,���p�ԏW���Ǘ����Ɣ,�s�����Y,�{���i���ɊǗ����j,���p��,���L���Y,�a�r�Œ莑�Y�^���i�^���i�������p�݌v�z,�������p,35296,35296,�U�N,6,20,�w���E���̑�,1�~,42095,���̑��擾,1,��,,��ʍ���,,,100,0,�s��,20,�����ȗߕʕ\��P�E�ԗ��y�щ^����E�O�f�̂��̈ȊO�̂��́E�����ԁE���̑��̂��́E���̑��̂���
0000000033-001-001,���i�䒠,,00-0275756,�ȈՃX�e�[�W�^�R�N���X�e�[�W�j�e�|�P�R�m�m�X��A�X�J�[�g�j�e�l�|�P�P�Q��,�S�R�s,'�����@����,�����@����,�a�r�Œ莑�Y�^���i�^���i�擾�z,�{���E�{����,1,2,1,1,11,51,���Ɉێ��Ǘ���,�s�����Y,�{���i���ɊǗ����j,��c�p,���L���Y,�a�r�Œ莑�Y�^���i�^���i�������p�݌v�z,�������p,41358,41358,�T�N,5,4,�w���E���̑�,1�~,42095,���̑��擾,1,��,,��ʍ���,,,100,0,�s��,4,�����ȗ߁E�ʕ\�P�E���y�є��i�E�P�P�O�f�̂��̈ȊO�̂��́E���̑��̂��́E���̑��̂���
0000000034-001-001,���i�䒠,,00-0007287,���^�ݕ������ԁi�o���j�����S�O�O���V�Q�S�V�^�g���^�J���f�B�i�t�k�S��`�s,�S�R�s,'�����@����,�����@����,�a�r�Œ莑�Y�^���i�^���i�擾�z,�{���E�{����,1,2,1,1,12,1,���p�ԏW���Ǘ����Ɣ,�s�����Y,�{���i���ɊǗ����j,���p��,���L���Y,�a�r�Œ莑�Y�^���i�^���i�������p�݌v�z,�������p,36682,36682,�T�N,5,16,�w���E���̑�,1�~,42095,���̑��擾,1,��,,��ʍ���,,,100,0,�s��,16,�����ȗߕʕ\��P�E�ԗ��y�щ^����E�O�f�̂��̈ȊO�̂��́E�����ԁE���̑��̂��́E�ݕ������ԁE���̑�
0000000035-001-001,���i�䒠,,00-0006465,��c�p�e�[�u���^�R�N���o�s�V���[�Y�I�t���[�Y��,�S�R�s,'�����@����,�����@����,�a�r�Œ莑�Y�^���i�^���i�擾�z,�{���E�{����,1,2,1,1,11,51,���Ɉێ��Ǘ���,�s�����Y,�{���i���ɊǗ����j,��c�p,���L���Y,�a�r�Œ莑�Y�^���i�^���i�������p�݌v�z,�������p,34327,34327,���ށi�������j,15,23,�w���E���̑�,1�~,42095,���̑��擾,1,�g,,��ʍ���,,,100,0,�s��,23,
0000000036-001-001,���i�䒠,,00-0006466,��c�p�e�[�u���^�R�N���o�s�V���[�Y�I�t���[�Y��,�S�R�s,'�����@����,�����@����,�a�r�Œ莑�Y�^���i�^���i�擾�z,�{���E�{����,1,2,1,1,11,51,���Ɉێ��Ǘ���,�s�����Y,�{���i���ɊǗ����j,��c�p,���L���Y,�a�r�Œ莑�Y�^���i�^���i�������p�݌v�z,�������p,34327,34327,���ށi�������j,15,23,�w���E���̑�,1�~,42095,���̑��擾,1,�g,,��ʍ���,,,100,0,�s��,23,
0000000037-001-001,���i�䒠,,00-0007294,���^�ݕ������ԁi�o���j�����S�O�O���X�S�V�T�^�j�b�T���G�L�X�p�[�g�S�v�c,�S�R�s,'�����@����,�����@����,�a�r�Œ莑�Y�^���i�^���i�擾�z,�{���E�{����,1,2,1,1,12,1,���p�ԏW���Ǘ����Ɣ,�s�����Y,�{���i���ɊǗ����j,���p��,���L���Y,�a�r�Œ莑�Y�^���i�^���i�������p�݌v�z,�������p,37393,37393,�T�N,5,14,�w���E���̑�,1�~,42095,���̑��擾,1,��,,��ʍ���,,,100,0,�s��,14,�����ȗߕʕ\��P�E�ԗ��y�щ^����E�O�f�̂��̈ȊO�̂��́E�����ԁE���̑��̂��́E�ݕ������ԁE���̑�
0000000038-001-001,���i�䒠,,00-0007372,�ؒ��u���w���v�^��t,�S�R�s,'�����@����,�����@����,�a�r�Œ莑�Y�^���i�^���i�擾�z,�{���E�{����,1,2,1,1,11,51,���Ɉێ��Ǘ���,�s�����Y,�{���i���ɊǗ����j,�ӏܗp,���L���Y,�a�r�Œ莑�Y�^���i�^���i�������p�݌v�z,�������p,25112,25112,�T�N,5,48,��,1�~,42095,���̑��擾,1,�_,,���̑�,,,100,,�s��,48,�����ȗ߁E�ʕ\�P�E���y�є��i�E�P�P�O�f�̂��̈ȊO�̂��́E���̑��̂��́E���̑��̂���
0000000039-001-001,���i�䒠,,00-0213263,���ʏ�p�ԁi�n�C�u���b�h�ԁj�^,�S�R�s,'�����@����,�����@����,�a�r�Œ莑�Y�^���i�^���i�擾�z,�{���E�{����,1,2,1,1,12,1,���p�ԏW���Ǘ����Ɣ,�s�����Y,�{���i���ɊǗ����j,���p��,���L���Y,�a�r�Œ莑�Y�^���i�^���i�������p�݌v�z,�������p,40359,40359,�U�N,6,6,�w���E���̑�,1�~,42095,���̑��擾,1,��,,��ʍ���,,,100,0,�s��,6,�����ȗߕʕ\��P�E�ԗ��y�щ^����E�O�f�̂��̈ȊO�̂��́E�����ԁE���̑��̂��́E���̑��̂���
0000000040-001-001,���i�䒠,,00-0007325,���^�ݕ������ԕ����S�O�O���U�Q�U�S�^�g���^�T�N�V�[�h�o���t�k,�S�R�s,'�����@����,�����@����,�a�r�Œ莑�Y�^���i�^���i�擾�z,�{���E�{����,1,2,1,1,12,1,���p�ԏW���Ǘ����Ɣ,�s�����Y,�{���i���ɊǗ����j,���p��,���L���Y,�a�r�Œ莑�Y�^���i�^���i�������p�݌v�z,�������p,38492,38492,�T�N,5,11,�w���E���̑�,1�~,42095,���̑��擾,1,��,,��ʍ���,,,100,0,�s��,11,�����ȗߕʕ\��P�E�ԗ��y�щ^����E�O�f�̂��̈ȊO�̂��́E�����ԁE���̑��̂��́E�ݕ������ԁE���̑�
0000000041-001-001,���i�䒠,,00-0007293,��p�ԁi�r�t�u�j�i�����R�O�O�ʂV�Q�U�V�j�^�X�Y�L�G�X�N�[�h,�S�R�s,'�����@����,�����@����,�a�r�Œ莑�Y�^���i�^���i�擾�z,�{���E�{����,1,2,1,1,12,1,���p�ԏW���Ǘ����Ɣ,�s�����Y,�{���i���ɊǗ����j,���p��,���L���Y,�a�r�Œ莑�Y�^���i�^���i�������p�݌v�z,�������p,38128,38128,�T�N,5,12,�w���E���̑�,1�~,42095,���̑��擾,1,��,,��ʍ���,,,100,0,�s��,12,�����ȗߕʕ\��P�E�ԗ��y�щ^����E�O�f�̂��̈ȊO�̂��́E�����ԁE���̑��̂��́E�ݕ������ԁE���̑�
0000000042-001-002,���i�䒠,,00-0007343,���^�ݕ������ԕ����S�O�O���X�R�S�S�^�j�b�T���`�c�o���c�w�S�v�c,�S�R�s,'�͓��N���[���Z���^�[,���|��,�a�r�Œ莑�Y�^���i�^���i�擾�z,�͓��N���[���Z���^�[,1,4,2,1,8,51,�͓��N���[���Z���^�[�ێ��Ǘ���,�s�����Y,�N���[���Z���^�[,�N���[���Z���^�[,���L���Y,�a�r�Œ莑�Y�^���i�^���i�������p�݌v�z,�������p,37389,37389,�T�N,5,14,�w���E���̑�,1�~,42825,���Ǌ�,1,��,,��ʍ���,,,100,0,�s��,14,�����ȗߕʕ\��P�E�ԗ��y�щ^����E�O�f�̂��̈ȊO�̂��́E�����ԁE���̑��̂��́E�ݕ������ԁE���̑�
0000000043-001-001,���i�䒠,,00-0007291,���^�ݕ������ԕ����S�O�O���S�W�U�U�^�j�b�T���`�c�o���c�w�Q�v�c,�S�R�s,'�����@����,�����@����,�a�r�Œ莑�Y�^���i�^���i�擾�z,�{���E�{����,1,2,1,1,12,1,���p�ԏW���Ǘ����Ɣ,�s�����Y,�{���i���ɊǗ����j,���p��,���L���Y,�a�r�Œ莑�Y�^���i�^���i�������p�݌v�z,�������p,37736,37736,�T�N,5,13,�w���E���̑�,1�~,42095,���̑��擾,1,��,,��ʍ���,,,100,0,�s��,13,�����ȗߕʕ\��P�E�ԗ��y�щ^����E�O�f�̂��̈ȊO�̂��́E�����ԁE���̑��̂��́E�ݕ������ԁE���̑�
0000000044-001-001,���i�䒠,,00-0000204,�������E�@�^�E�`�_�y�[�p�[�h���f�`�|�Q�v,�S�R�s,'�����@����,�����@����,�a�r�Œ莑�Y�^���i�^���i�擾�z,�{���E�{����,1,2,1,1,7,51,�򏑈����,�s�����Y,�{���i���ɊǗ����j,������p,���L���Y,�a�r�Œ莑�Y�^���i�^���i�������p�݌v�z,�������p,33007,33007,������ށi�@�B���u�j,10,26,�w���E���̑�,1�~,42095,���̑��擾,1,��,,��ʍ���,,,100,0,�s��,26,
0000000045-001-001,���i�䒠,,00-0007373,�΍p�u���w���v�^���w����,�S�R�s,'�����@����,�����@����,�a�r�Œ莑�Y�^���i�^���i�擾�z,�{���E�{����,1,2,1,1,11,51,���Ɉێ��Ǘ���,�s�����Y,�{���i���ɊǗ����j,�ӏܗp,���L���Y,�a�r�Œ莑�Y�^���i�^���i�������p�݌v�z,�������p,25112,25112,�T�N,5,48,��,1�~,42095,���̑��擾,1,�_,,���̑�,,,100,,�s��,48,�����ȗ߁E�ʕ\�P�E���y�є��i�E�P�P�O�f�̂��̈ȊO�̂��́E���̑��̂��́E���̑��̂���
0000000046-001-001,���i�䒠,,00-0007344,���^�ݕ������ԕ����S�O�O���Q�V�X�T�^�j�b�T���`�c�o���c�w,�S�R�s,'�����@����,�����@����,�a�r�Œ莑�Y�^���i�^���i�擾�z,�{���E�{����,1,2,1,1,12,1,���p�ԏW���Ǘ����Ɣ,�s�����Y,�{���i���ɊǗ����j,���p��,���L���Y,�a�r�Œ莑�Y�^���i�^���i�������p�݌v�z,�������p,38259,38259,�T�N,5,12,�w���E���̑�,1�~,42095,���̑��擾,1,��,,��ʍ���,,,100,0,�s��,12,�����ȗߕʕ\��P�E�ԗ��y�щ^����E�O�f�̂��̈ȊO�̂��́E�����ԁE���̑��̂��́E�ݕ������ԁE���̑�
0000000047-001-001,���i�䒠,,00-0007378,�G��i�[�f���j���ϊJ��P�O�O�N�L�O��i�^�e�P�O�O���P�U�Q�~�P�R�O����,�S�R�s,'�����@����,�����@����,�a�r�Œ莑�Y�^���i�^���i�擾�z,�{���E�{����,1,2,1,1,11,51,���Ɉێ��Ǘ���,�s�����Y,�{���i���ɊǗ����j,�ӏܗp,���L���Y,�a�r�Œ莑�Y�^���i�^���i�������p�݌v�z,�������p,30902,30902,�W�N,8,32,��,1�~,42095,���̑��擾,1,�_,,���̑�,,,100,,�s��,32,�����ȗߕʕ\��P�E���y�є��i�E�P�Ƌ�A�d�C�@��A�K�X�@��y�щƒ�p�i�E���������i�E���̑��̂���
0000000048-001-001,���i�䒠,,00-0000675,�S�R�s�s�s�錾�V���{���X�^���h�^�X�e�����X���Q�C�O�O�O�~�U�O�O�o,�S�R�s,'������,�����@����,�a�r�Œ莑�Y�^���i�^���i�擾�z,�{���E������,1,2,1,1,2,1,���a���i���Ɣ,�s�����Y,�{���i���ɊǗ����j,�[���p,���L���Y,�a�r�Œ莑�Y�^���i�^���i�������p�݌v�z,�������p,33693,33693,�R�N,3,25,�w���E���̑�,1�~,42095,���̑��擾,1,��,,�s��,,,100,,�s��,25,�����ȗߕʕ\��P�E���y�є��i�E�Ŕy�эL�����E�ŔA�l�I���T�C���y�ыC��
0000000049-001-001,���i�䒠,,00-0000674,�S�R�s�s�s�錾�V���{���X�^���h�^�X�e�����X���Q�C�O�O�O�~�U�O�O�o,�S�R�s,'�s�������Z���^�[,�����@����,�a�r�Œ莑�Y�^���i�^���i�擾�z,�s�������Z���^�[,1,2,1,1,2,1,���a���i���Ɣ,�s�����Y,�z�[����,�[���p,���L���Y,�a�r�Œ莑�Y�^���i�^���i�������p�݌v�z,�������p,33693,33693,�R�N,3,25,�w���E���̑�,1�~,42095,���̑��擾,1,��,,�s��,,,100,,�s��,25,�����ȗߕʕ\��P�E���y�є��i�E�Ŕy�эL�����E�ŔA�l�I���T�C���y�ыC��
0000000050-001-001,���i�䒠,,00-0007374,�G��u�֒�R�v�^�z���t�P�V�R�~�P�P�R�~�W,�S�R�s,'�����@����,�����@����,�a�r�Œ莑�Y�^���i�^���i�擾�z,�{���E�{����,1,2,1,1,11,51,���Ɉێ��Ǘ���,�s�����Y,�{���i���ɊǗ����j,�ӏܗp,���L���Y,�a�r�Œ莑�Y�^���i�^���i�������p�݌v�z,�������p,26577,26577,�W�N,8,44,��,1�~,42095,���̑��擾,1,�_,,���̑�,,,100,,�s��,44,�����ȗߕʕ\��P�E���y�є��i�E�P�Ƌ�A�d�C�@��A�K�X�@��y�щƒ�p�i�E���������i�E���̑��̂���
0000000051-001-001,���i�䒠,,00-0202711,�X�N���[���^�P�V�O�C���`���C�����X���X�N���[���{�b�N�X�t,�S�R�s,'���c��,�����@����,�a�r�Œ莑�Y�^���i�^���i�擾�z,�{���E�{����,1,2,1,1,2,51,�����@���ۊǗ�������,�s�����Y,�{���i���ɊǗ����j,���c�p,���L���Y,�a�r�Œ莑�Y�^���i�^���i�������p�݌v�z,�������p,35724,35724,�T�N,5,19,�w���E���̑�,1�~,42095,���̑��擾,1,��,,�s��,,,100,,�s��,19,�����ȗߕʕ\��P�E���y�є��i�E�����@��y�ђʐM�@��E���̑��̎����@��
0000000052-001-001,���i�䒠,,00-0007424,���G�u�Γ쉓�]�v�^�W�O�~�X�V�p�i�S�O���j,�S�R�s,'�����@����,�����@����,�a�r�Œ莑�Y�^���i�^���i�擾�z,�{���E�{����,1,2,1,1,11,51,���Ɉێ��Ǘ���,�s�����Y,�{���i���ɊǗ����j,�ӏܗp,���L���Y,�a�r�Œ莑�Y�^���i�^���i�������p�݌v�z,�������p,34386,34386,�W�N,8,23,��,1�~,42095,���̑��擾,1,�_,,���̑�,,,100,,�s��,23,�����ȗߕʕ\��P�E���y�є��i�E�P�Ƌ�A�d�C�@��A�K�X�@��y�щƒ�p�i�E���������i�E���̑��̂���
0000000053-001-001,���i�䒠,,00-0007345,�y�ݕ������ԕ����S�W�O���X�W�T�W�^�_�C�n�c�n�C�[�b�g�J�[�S,�S�R�s,'�����@����,�����@����,�a�r�Œ莑�Y�^���i�^���i�擾�z,�{���E�{����,1,2,1,1,12,1,���p�ԏW���Ǘ����Ɣ,�s�����Y,�{���i���ɊǗ����j,���p��,���L���Y,�a�r�Œ莑�Y�^���i�^���i�������p�݌v�z,�������p,38623,38623,�S�N,4,11,�w���E���̑�,1�~,42095,���̑��擾,1,��,,��ʍ���,,,100,0,�s��,11,�����ȗߕʕ\��P�E�ԗ��y�щ^����E�O�f�̂��̈ȊO�̂��́E�����ԁE���^��
0000000054-001-001,���i�䒠,,00-0007318,�y��p�����ԕ����T�O���T�S�W�V�^�X�Y�L�S�֋쓮�E�U�U�O����,�S�R�s,'�����@����,�����@����,�a�r�Œ莑�Y�^���i�^���i�擾�z,�{���E�{����,1,2,1,1,12,1,���p�ԏW���Ǘ����Ɣ,�s�����Y,�{���i���ɊǗ����j,���p��,���L���Y,�a�r�Œ莑�Y�^���i�^���i�������p�݌v�z,�������p,34849,34849,�S�N,4,21,�w���E���̑�,1�~,42095,���̑��擾,1,��,,��ʍ���,,,100,0,�s��,21,�����ȗߕʕ\��P�E�ԗ��y�щ^����E�O�f�̂��̈ȊO�̂��́E�����ԁE���^��
0000000055-001-001,���i�䒠,,00-0007319,�y��p�����ԁi�����T�O�P�W�O�P�j�^�X�o�����B���B�I�S�v�c�T�h�A,�S�R�s,'�����@����,�����@����,�a�r�Œ莑�Y�^���i�^���i�擾�z,�{���E�{����,1,2,1,1,12,1,���p�ԏW���Ǘ����Ɣ,�s�����Y,�{���i���ɊǗ����j,���p��,���L���Y,�a�r�Œ莑�Y�^���i�^���i�������p�݌v�z,�������p,35577,35577,�S�N,4,19,�w���E���̑�,1�~,42095,���̑��擾,1,��,,��ʍ���,,,100,0,�s��,19,�����ȗߕʕ\��P�E�ԗ��y�щ^����E�O�f�̂��̈ȊO�̂��́E�����ԁE���^��
0000000056-001-001,���i�䒠,,00-0008823,�y��p�ԁi�����T�O�ЂV�U�U�W�j�^�_�C�n�c�~���o�������`�s,�S�R�s,'�����@����,�����@����,�a�r�Œ莑�Y�^���i�^���i�擾�z,�{���E�{����,1,2,1,1,12,1,���p�ԏW���Ǘ����Ɣ,�s�����Y,�{���i���ɊǗ����j,���p��,���L���Y,�a�r�Œ莑�Y�^���i�^���i�������p�݌v�z,�������p,37027,37027,�S�N,4,15,�w���E���̑�,1�~,42095,���̑��擾,1,��,,��ʍ���,,,100,0,�s��,15,�����ȗߕʕ\��P�E�ԗ��y�щ^����E�O�f�̂��̈ȊO�̂��́E�����ԁE���^��
0000000057-001-001,���i�䒠,,00-0007315,�y��p�ԁi�����T�O�܂W�Q�|�V�U�j�^�O�H�~�j�J���H�C�X�S�v�c,�S�R�s,'�����@����,�����@����,�a�r�Œ莑�Y�^���i�^���i�擾�z,�{���E�{����,1,2,1,1,12,1,���p�ԏW���Ǘ����Ɣ,�s�����Y,�{���i���ɊǗ����j,���p��,���L���Y,�a�r�Œ莑�Y�^���i�^���i�������p�݌v�z,�������p,37398,37398,�S�N,4,14,�w���E���̑�,1�~,42095,���̑��擾,1,��,,��ʍ���,,,100,0,�s��,14,�����ȗߕʕ\��P�E�ԗ��y�щ^����E�O�f�̂��̈ȊO�̂��́E�����ԁE���^��